{"text_format":"1","workbook":"xlsx","n_sheets":26,"sheets":["Résumé","Voirie","PIC","Vélos","Piétons","Intermodalité","Mobipôle 1","Mobipôle 2","Mobipôle 3","Mobipôle 4","Mobipôle 5","Mobipôle Existant 1","Mobipôle Existant 2","Mobipôle Existant 3","Mobipôle Existant 4","Mobipôle Existant 5","Bâtiment","Plan de localisation","Photos des lieux","Croquis de l'aménagement","Estimation détaillée des coûts","Croquis échelle 1-100","Typoligie Mobipôles","communes","liste","metadata"],"not_rendered":{"charts":0,"images":2,"macros":1,"external_links":0,"defined_names":56,"comments":2,"pivot_tables":0},"unopened":[],"bounds":{"document_bytes":16777216,"sheet_cells":100000,"rows_first":2000,"rows_last":500,"rows_between":2000,"halvings":0,"cell_chars":16384,"cell_head_chars":4096},"cells_cut":0,"cells_raw":0,"read":"whole","date_system":"1900"}

{"sheet":"Résumé","index":0,"n_rows":17,"n_cols":6,"rows_kept":17,"cut":false,"hidden":false,"merged":[[15,2,16,2],[4,1,5,1],[2,2,3,2],[12,2,13,2]]}
["Nom de la commune","Commune (code INS)","Commentaires "]
[{"$f":"VLOOKUP(B2,communes!A1:C263,2,FALSE)","v":{"$error":"#N/A"}},null,"Indiquer le code INS de votre commune en B2. Le nom de votre commune apparaîtra de manière automatique en A2. "]
[null,null,"Il y a lieu de compléter un fichier Excel 'Fiche' par ligne reprise dans le fichier récapitulatif des investissements. 1 fiche = 1 investissement"]
["Type de travaux"]
["Objet précis"]
[]
{"$rows_left_out":12}
{"sheet":"Voirie","index":1,"n_rows":53,"n_cols":6,"rows_kept":53,"cut":false,"hidden":true,"merged":[[47,0,47,1],[49,0,49,1],[45,0,45,1],[46,0,46,1],[30,2,35,2]]}
["Nom de la commune","Commune (code INS)","Commentaires "]
[{"$f":"VLOOKUP(B2,communes!A1:C263,2,FALSE)","v":{"$error":"#N/A"}},{"$f":"IF(Résumé!B2>0,Résumé!B2,\"\")","v":""}]
[]
["Nombre de rue(s) traitées"]
["Km de voirie"]
[]
{"$rows_left_out":48}
{"sheet":"PIC","index":2,"n_rows":36,"n_cols":7,"rows_kept":36,"cut":false,"hidden":true,"merged":[[19,1,19,2],[20,1,20,2],[21,1,21,2],[35,1,35,2],[29,1,29,2],[30,1,30,2],[32,1,32,2],[33,1,33,2],[34,1,34,2],[27,1,27,2],[22,1,22,2],[23,1,23,2],[24,1,24,2],[25,1,25,2],[26,1,26,2],[1,1,1,2],[8,1,8,2],[9,1,9,3],[16,1,16,3],[18,1,18,2]]}
["Voirie","Unité","Q.P.","P.U. en €","Sommes des travaux en €",null,"Commentaires"]
["Démolitions sélectives et déblais","prix global"]
["Sous-fondation","m²"]
["Fondation","m²",null,null,{"$f":"C4*D4","v":0}]
["Revêtement (type hydro, béton, pavés, dalles ...)","m²",null,null,{"$f":"C5*D5","v":0}]
["Trottoirs","m²",null,null,0,null,"si pas comptabilisés dans l'estimatif PIMACI Piétons"]
{"$rows_left_out":31}
{"sheet":"Vélos","index":3,"n_rows":38,"n_cols":7,"rows_kept":38,"cut":false,"hidden":true,"merged":[[17,0,17,4],[18,0,18,4],[19,0,19,4],[20,0,20,4],[12,0,12,4],[13,0,13,4],[14,0,14,4],[15,0,15,4],[16,0,16,4],[0,0,0,4],[1,0,1,4],[2,0,2,4],[3,0,3,4],[4,0,4,4],[5,0,5,4],[34,1,34,2],[35,1,35,2],[36,1,36,2],[37,1,37,2],[23,1,23,2],[28,1,28,2],[29,1,29,3],[31,1,31,2],[32,1,32,2],[6,0,6,4],[7,0,7,4],[8,0,8,4],[9,0,9,4],[10,0,10,4],[11,0,11,4]]}
["Quel est l’objectif de cet aménagement (dans le respect du principe STOP)? En quoi cet aménagement améliore-t-il la cyclabilité? ",null,null,null,null,null,"Commentaires "]
[null,null,null,null,null,null,"A2: à compléter. Le principe STOP est le principe selon lequel les aménagements sont priorisés de la manière suivante: \na) les aménagements en faveur des piétons;\nb) les aménagements en faveur des cyclistes et de la micromobilité douce;\nc) les aménagements en faveur des transports publics, transports privés collectifs (taxis, voitures partagées, covoiturage);\nd) les aménagements en faveur des transports individuels (ex: parking de délestage). "]
[]
["Quel est le niveau de priorité dans le cadre de la mise en œuvre du réseau cyclable utilitaire communal? Veuillez préciser dans le plan de localisation, les pôles reliés (par exemple noyaux urbains ou villageois, pôles d'habitat, pôles d'emploi, scolaires, d'équipements ou de commerces, noeuds d'intermodalité ...), qu'ils soient intra ou extracommunaux ainsi que les projets proposés. Expliquez la raison de l'itinéraire choisi dans le cas où il ne s'agit pas de l'itinéraire le plus rapide/direct."]
[]
[]
{"$rows_left_out":33}
{"sheet":"Piétons","index":4,"n_rows":34,"n_cols":7,"rows_kept":34,"cut":false,"hidden":true,"merged":[[17,0,17,4],[11,0,11,4],[12,0,12,4],[13,0,13,4],[14,0,14,4],[15,0,15,4],[0,0,0,4],[1,0,1,4],[3,0,3,4],[4,0,4,4],[2,0,2,4],[5,0,5,4],[30,1,30,2],[31,1,31,2],[32,1,32,2],[33,1,33,2],[19,1,19,2],[24,1,24,2],[25,1,25,3],[27,1,27,2],[28,1,28,2],[6,0,6,4],[7,0,7,4],[9,0,9,4],[10,0,10,4],[8,0,8,4],[16,0,16,4]]}
["Quel est l’objectif de cet aménagement (dans le respect du principe STOP)? En quoi cet aménagement améliore-t-il la marchabilité? ",null,null,null,null,null,"Commentaires "]
[null,null,null,null,null,null,"A2 : à compléter. Le principe STOP est le principe selon lequel les aménagements sont priorisés de la manière suivante: \na) les aménagements en faveur des piétons;\nb) les aménagements en faveur des cyclistes et de la micromobilité douce;\nc) les aménagements en faveur des transports publics, transports privés collectifs (taxis, voitures partagées, covoiturage);\nd) les aménagements en faveur des transports individuels (ex: parking de délestage). "]
[]
["Quel est le niveau de priorité de ce projet dans le cadre de la mise en œuvre du réseau piéton utilitaire communal? Veuillez préciser dans le plan de localisation, les pôles reliés (par exemple: noyaux urbains ou villageois, pôles d'habitat, pôles d'emploi, scolaires, d'équipements ou de commerces, noeuds d'intermodalité...), qu'ils soient intra ou extracommunaux ainsi que les projets proposés. Expliquez la raison de l'itinéraire choisi dans le cas où il ne s'agit pas de l'itinéraire le plus rapide/direct."]
[]
[]
{"$rows_left_out":29}
{"sheet":"Intermodalité","index":5,"n_rows":16,"n_cols":4,"rows_kept":16,"cut":false,"hidden":true,"merged":[[11,1,11,3],[12,1,12,3],[14,2,14,3],[15,2,15,3]]}
[null,"Nom de la commune","Commune (code INS)"]
[null,{"$f":"VLOOKUP(C2,communes!A1:C263,2,FALSE)","v":{"$error":"#N/A"}},{"$f":"Résumé!B2","v":0},{"$f":"IF(OR(C2=92094,C2=92141,C2=25112,C2=25121,C2=92142),metadata!W7,IF(OR(C2=25044,C2=63049,C2=61043),metadata!W8,\"\"))","v":""}]
[]
[null,null,"Offre structurante de transport en commun","Note explicative sur l'offre de mobipôle attendue"]
[null,null,{"$f":"VLOOKUP(C2,communes!A1:C263,3,FALSE)","v":{"$error":"#N/A"}},{"$f":"VLOOKUP(C5,metadata!V3:W5,2,FALSE)","v":{"$error":"#N/A"}}]
[]
{"$rows_left_out":11}
{"sheet":"Mobipôle 1","index":6,"n_rows":33,"n_cols":9,"rows_kept":33,"cut":false,"hidden":true,"merged":[[6,1,6,3],[11,2,11,3],[13,1,13,3],[8,4,9,4],[14,1,14,3],[16,1,16,3],[17,1,17,3],[7,1,7,3]]}
[null,"Nom de la commune","Commune (code INS)","FICHE MOBIPÔLE 1"]
[null,{"$f":"VLOOKUP(C2,communes!A1:C263,2,FALSE)","v":{"$error":"#N/A"}},{"$f":"Intermodalité!C2","v":0},{"$f":"IF(OR(C2=92094,C2=92141,C2=25112,C2=25121,C2=92142),metadata!W7,IF(OR(C2=25044,C2=63049,C2=61043),metadata!W8,\"\"))","v":""}]
[]
[null,null,"Offre structurante de transport en commun","Note explicative sur l'offre de mobipôle attendue"]
[null,null,{"$f":"VLOOKUP(C2,communes!A1:C263,3,FALSE)","v":{"$error":"#N/A"}},{"$f":"VLOOKUP(C5,metadata!V3:W5,2,FALSE)","v":{"$error":"#N/A"}}]
[]
{"$rows_left_out":28}
{"sheet":"Mobipôle 2","index":7,"n_rows":33,"n_cols":9,"rows_kept":33,"cut":false,"hidden":true,"merged":[[17,1,17,3],[6,1,6,3],[7,1,7,3],[11,2,11,3],[13,1,13,3],[14,1,14,3],[16,1,16,3]]}
[null,"Nom de la commune","Commune (code INS)","FICHE MOBIPÔLE 2"]
[null,{"$f":"VLOOKUP(C2,communes!A1:C263,2,FALSE)","v":{"$error":"#N/A"}},{"$f":"Intermodalité!C2","v":0},{"$f":"IF(OR(C2=92094,C2=92141,C2=25112,C2=25121,C2=92142),metadata!W7,IF(OR(C2=25044,C2=63049,C2=61043),metadata!W8,\"\"))","v":""}]
[]
[null,null,"Offre structurante de transport en commun","Note explicative sur l'offre de mobipôle attendue"]
[null,null,{"$f":"VLOOKUP(C2,communes!A1:C263,3,FALSE)","v":{"$error":"#N/A"}},{"$f":"VLOOKUP(C5,metadata!V3:W5,2,FALSE)","v":{"$error":"#N/A"}}]
[]
{"$rows_left_out":28}
{"sheet":"Mobipôle 3","index":8,"n_rows":33,"n_cols":9,"rows_kept":33,"cut":false,"hidden":true,"merged":[[17,1,17,3],[6,1,6,3],[7,1,7,3],[11,2,11,3],[13,1,13,3],[14,1,14,3],[16,1,16,3]]}
[null,"Nom de la commune","Commune (code INS)","FICHE MOBIPÔLE 3"]
[null,{"$f":"VLOOKUP(C2,communes!A1:C263,2,FALSE)","v":{"$error":"#N/A"}},{"$f":"Intermodalité!C2","v":0},{"$f":"IF(OR(C2=92094,C2=92141,C2=25112,C2=25121,C2=92142),metadata!W7,IF(OR(C2=25044,C2=63049,C2=61043),metadata!W8,\"\"))","v":""}]
[]
[null,null,"Offre structurante de transport en commun","Note explicative sur l'offre de mobipôle attendue"]
[null,null,{"$f":"VLOOKUP(C2,communes!A1:C263,3,FALSE)","v":{"$error":"#N/A"}},{"$f":"VLOOKUP(C5,metadata!V3:W5,2,FALSE)","v":{"$error":"#N/A"}}]
[]
{"$rows_left_out":28}
{"sheet":"Mobipôle 4","index":9,"n_rows":33,"n_cols":9,"rows_kept":33,"cut":false,"hidden":true,"merged":[[17,1,17,3],[6,1,6,3],[7,1,7,3],[11,2,11,3],[13,1,13,3],[14,1,14,3],[16,1,16,3]]}
[null,"Nom de la commune","Commune (code INS)","FICHE MOBIPÔLE 4"]
[null,{"$f":"VLOOKUP(C2,communes!A1:C263,2,FALSE)","v":{"$error":"#N/A"}},{"$f":"Intermodalité!C2","v":0},{"$f":"IF(OR(C2=92094,C2=92141,C2=25112,C2=25121,C2=92142),metadata!W7,IF(OR(C2=25044,C2=63049,C2=61043),metadata!W8,\"\"))","v":""}]
[]
[null,null,"Offre structurante de transport en commun","Note explicative sur l'offre de mobipôle attendue"]
[null,null,{"$f":"VLOOKUP(C2,communes!A1:C263,3,FALSE)","v":{"$error":"#N/A"}},{"$f":"VLOOKUP(C5,metadata!V3:W5,2,FALSE)","v":{"$error":"#N/A"}}]
[]
{"$rows_left_out":28}
{"sheet":"Mobipôle 5","index":10,"n_rows":33,"n_cols":9,"rows_kept":33,"cut":false,"hidden":true,"merged":[[17,1,17,3],[6,1,6,3],[7,1,7,3],[11,2,11,3],[13,1,13,3],[14,1,14,3],[16,1,16,3]]}
[null,"Nom de la commune","Commune (code INS)","FICHE MOBIPÔLE 5"]
[null,{"$f":"VLOOKUP(C2,communes!A1:C263,2,FALSE)","v":{"$error":"#N/A"}},{"$f":"Intermodalité!C2","v":0},{"$f":"IF(OR(C2=92094,C2=92141,C2=25112,C2=25121,C2=92142),metadata!W7,IF(OR(C2=25044,C2=63049,C2=61043),metadata!W8,\"\"))","v":""}]
[]
[null,null,"Offre structurante de transport en commun","Note explicative sur l'offre de mobipôle attendue"]
[null,null,{"$f":"VLOOKUP(C2,communes!A1:C263,3,FALSE)","v":{"$error":"#N/A"}},{"$f":"VLOOKUP(C5,metadata!V3:W5,2,FALSE)","v":{"$error":"#N/A"}}]
[]
{"$rows_left_out":28}
{"sheet":"Mobipôle Existant 1","index":11,"n_rows":13,"n_cols":9,"rows_kept":13,"cut":false,"hidden":true,"merged":[[5,5,5,6],[13,1,13,3],[6,1,6,3],[7,1,7,3],[9,1,9,3],[10,1,10,3],[12,1,12,3]]}
[null,"Nom de la commune","Commune (code INS)","FICHE MOBIPÔLE EXISTANT 1"]
[null,{"$f":"VLOOKUP(C2,communes!A1:C263,2,FALSE)","v":{"$error":"#N/A"}},{"$f":"Intermodalité!C2","v":0},{"$f":"IF(OR(C2=92094,C2=92141,C2=25112,C2=25121,C2=92142),metadata!W7,IF(OR(C2=25044,C2=63049,C2=61043),metadata!W8,\"\"))","v":""}]
[]
[null,null,"Offre structurante de transport en commun","Note explicative sur l'offre de mobipôle attendue:"]
[null,null,{"$f":"VLOOKUP(C2,communes!A1:C263,3,FALSE)","v":{"$error":"#N/A"}},{"$f":"VLOOKUP(C5,metadata!V3:W5,2,FALSE)","v":{"$error":"#N/A"}}]
[null,null,null,null,null,"Cordonnées (x,y) du mobipôle/mobipoint"]
{"$rows_left_out":8}
{"sheet":"Mobipôle Existant 2","index":12,"n_rows":13,"n_cols":9,"rows_kept":13,"cut":false,"hidden":true,"merged":[[5,5,5,6],[13,1,13,3],[6,1,6,3],[7,1,7,3],[9,1,9,3],[10,1,10,3],[12,1,12,3]]}
[null,"Nom de la commune","Commune (code INS)","FICHE MOBIPÔLE EXISTANT 2"]
[null,{"$f":"VLOOKUP(C2,communes!A1:C263,2,FALSE)","v":{"$error":"#N/A"}},{"$f":"Intermodalité!C2","v":0},{"$f":"IF(OR(C2=92094,C2=92141,C2=25112,C2=25121,C2=92142),metadata!W7,IF(OR(C2=25044,C2=63049,C2=61043),metadata!W8,\"\"))","v":""}]
[]
[null,null,"Offre structurante de transport en commun","Note explicative sur l'offre de mobipôle attendue:"]
[null,null,{"$f":"VLOOKUP(C2,communes!A1:C263,3,FALSE)","v":{"$error":"#N/A"}},{"$f":"VLOOKUP(C5,metadata!V3:W5,2,FALSE)","v":{"$error":"#N/A"}}]
[null,null,null,null,null,"Cordonnées (x,y) du mobipôle/mobipoint"]
{"$rows_left_out":8}
{"sheet":"Mobipôle Existant 3","index":13,"n_rows":13,"n_cols":9,"rows_kept":13,"cut":false,"hidden":true,"merged":[[5,5,5,6],[13,1,13,3],[6,1,6,3],[7,1,7,3],[9,1,9,3],[10,1,10,3],[12,1,12,3]]}
[null,"Nom de la commune","Commune (code INS)","FICHE MOBIPÔLE EXISTANT 3"]
[null,{"$f":"VLOOKUP(C2,communes!A1:C263,2,FALSE)","v":{"$error":"#N/A"}},{"$f":"Intermodalité!C2","v":0},{"$f":"IF(OR(C2=92094,C2=92141,C2=25112,C2=25121,C2=92142),metadata!W7,IF(OR(C2=25044,C2=63049,C2=61043),metadata!W8,\"\"))","v":""}]
[]
[null,null,"Offre structurante de transport en commun","Note explicative sur l'offre de mobipôle attendue:"]
[null,null,{"$f":"VLOOKUP(C2,communes!A1:C263,3,FALSE)","v":{"$error":"#N/A"}},{"$f":"VLOOKUP(C5,metadata!V3:W5,2,FALSE)","v":{"$error":"#N/A"}}]
[null,null,null,null,null,"Cordonnées (x,y) du mobipôle/mobipoint"]
{"$rows_left_out":8}
{"sheet":"Mobipôle Existant 4","index":14,"n_rows":13,"n_cols":9,"rows_kept":13,"cut":false,"hidden":true,"merged":[[5,5,5,6],[13,1,13,3],[6,1,6,3],[7,1,7,3],[9,1,9,3],[10,1,10,3],[12,1,12,3]]}
[null,"Nom de la commune","Commune (code INS)","FICHE MOBIPÔLE EXISTANT 4"]
[null,{"$f":"VLOOKUP(C2,communes!A1:C263,2,FALSE)","v":{"$error":"#N/A"}},{"$f":"Intermodalité!C2","v":0},{"$f":"IF(OR(C2=92094,C2=92141,C2=25112,C2=25121,C2=92142),metadata!W7,IF(OR(C2=25044,C2=63049,C2=61043),metadata!W8,\"\"))","v":""}]
[]
[null,null,"Offre structurante de transport en commun","Note explicative sur l'offre de mobipôle attendue:"]
[null,null,{"$f":"VLOOKUP(C2,communes!A1:C263,3,FALSE)","v":{"$error":"#N/A"}},{"$f":"VLOOKUP(C5,metadata!V3:W5,2,FALSE)","v":{"$error":"#N/A"}}]
[null,null,null,null,null,"Cordonnées (x,y) du mobipôle/mobipoint"]
{"$rows_left_out":8}
{"sheet":"Mobipôle Existant 5","index":15,"n_rows":13,"n_cols":9,"rows_kept":13,"cut":false,"hidden":true,"merged":[[5,5,5,6],[13,1,13,3],[6,1,6,3],[7,1,7,3],[9,1,9,3],[10,1,10,3],[12,1,12,3]]}
[null,"Nom de la commune","Commune (code INS)","FICHE MOBIPÔLE EXISTANT 5"]
[null,{"$f":"VLOOKUP(C2,communes!A1:C263,2,FALSE)","v":{"$error":"#N/A"}},{"$f":"Intermodalité!C2","v":0},{"$f":"IF(OR(C2=92094,C2=92141,C2=25112,C2=25121,C2=92142),metadata!W7,IF(OR(C2=25044,C2=63049,C2=61043),metadata!W8,\"\"))","v":""}]
[]
[null,null,"Offre structurante de transport en commun","Note explicative sur l'offre de mobipôle attendue:"]
[null,null,{"$f":"VLOOKUP(C2,communes!A1:C263,3,FALSE)","v":{"$error":"#N/A"}},{"$f":"VLOOKUP(C5,metadata!V3:W5,2,FALSE)","v":{"$error":"#N/A"}}]
[null,null,null,null,null,"Cordonnées (x,y) du mobipôle/mobipoint"]
{"$rows_left_out":8}
{"sheet":"Bâtiment","index":16,"n_rows":47,"n_cols":3,"rows_kept":47,"cut":false,"hidden":true,"merged":[[41,0,41,1],[7,0,7,1],[10,0,10,1],[32,0,32,1]]}
[null,null,"Commentaires"]
["Type d'ouvrage:"]
[]
["Type(s) d'investissement (plusieurs choix possibles):\n"]
[]
[]
{"$rows_left_out":42}
{"sheet":"Plan de localisation","index":17,"n_rows":0,"n_cols":0,"rows_kept":0,"cut":false,"hidden":true,"merged":[]}

{"sheet":"Photos des lieux","index":18,"n_rows":0,"n_cols":0,"rows_kept":0,"cut":false,"hidden":true,"merged":[]}

{"sheet":"Croquis de l'aménagement","index":19,"n_rows":2,"n_cols":2,"rows_kept":2,"cut":false,"hidden":true,"merged":[[1,1,1,9]]}
[]
[null,"Croquis de l'aménagement"]

{"sheet":"Estimation détaillée des coûts","index":20,"n_rows":0,"n_cols":0,"rows_kept":0,"cut":false,"hidden":true,"merged":[]}

{"sheet":"Croquis échelle 1-100","index":21,"n_rows":2,"n_cols":2,"rows_kept":2,"cut":false,"hidden":true,"merged":[[1,1,1,9]]}
[]
[null,"Croquis principal à l'échelle 1/100e avec affectation des locaux"]

{"sheet":"Typoligie Mobipôles","index":22,"n_rows":110,"n_cols":9,"rows_kept":110,"cut":false,"hidden":true,"merged":[[13,1,13,7],[0,1,1,1],[2,1,2,7],[3,1,3,7],[4,0,10,0],[11,0,12,0],[74,0,85,0],[14,0,27,0],[28,0,29,0],[30,1,30,7],[31,0,40,0],[42,1,42,7],[43,0,51,0],[52,0,53,0],[54,1,54,7],[55,1,55,7],[56,0,71,0],[73,1,73,7],[86,1,86,7],[87,0,90,0],[91,1,91,7],[92,0,96,0],[100,3,103,3],[100,4,103,4],[100,5,103,5],[100,6,103,6]]}
[null,"Fonctionnalités cibles selon le type de mobipôles/mobipoints \nen Wallonie","Gares régionales (+ de 8.000 montées / jour de semaine)","Gares supra-locales (entre 500 et 8.000 montées) de destination ou mixte (destination et origine) ","Gares supra-locales (entre 500 et 8.000 montées) d'origine\n\nGares locales\n\nGares Bus (hors gare train)","Arrêts de Bus sur lignes structurantes (Express, Tram, BHNS, …)","Points non urbains de multimodalité \n\nsans Transport Public structurant","Points urbains de multimodalité \n\nsans Transport Public structurant"]
[null,null,"XL","L","M","S","XS","XS mobipoint"]
[null,"MOBILITÉ"]
[null,"Mobilité active (piétons)"]
["Sur le site d'intermodalité","Trottoirs et passages piétons larges et sécurisés sur le site et pour l'accès immédiat ",null,null,null,null,null,null,2]
[null,"Proximité entre modes pour un transfert court et intuitif"]
{"$rows_left_out":105}
{"sheet":"communes","index":23,"n_rows":263,"n_cols":3,"rows_kept":263,"cut":false,"hidden":true,"merged":[]}
["ADMUKEY","ADMUNAFR","Desserte"]
[52074,"Aiseau-Presles","Connectée"]
[61003,"Amay","Connectée"]
[63001,"Amblève","Connectée"]
[92003,"Andenne","Connectée"]
[56001,"Anderlues","Connectée"]
{"$rows_left_out":258}
{"sheet":"liste","index":24,"n_rows":70,"n_cols":22,"rows_kept":70,"cut":false,"hidden":true,"merged":[]}
["Voirie",1,"Approbation du plan","Oui","PIC","pas de trottoir","longitudinal d'un côté",null,"propriétaire",null,"Création de parking ",null,null,"Conforme",null,"dégradation superficielle",null,"nécessaire","voirie(s)","maison communale","construction neuve","fossé à ciel ouvert"]
["Bâtiment",2,"Réunion plénière ","Non","PIWACY","un trottoir d'un côté","longitudinal des 2 côtés",null,"droit de jouissance",null,"Création d'espace public (place, nœud d'intermodalité …)",null,null,"Pas conforme",null,"dégradation structurelle",null,"pas nécessaire","piétons","bâtiment technique","extension","aqueduc"]
[null,3,"Projet",null,"Mobilité active","un trottoir de chaque côté","en épi",null,"accord du propriétaire",null,"Création d'itinéraire cyclable",null,null,null,null,null,null,null,"cyclistes","locaux CPAS","rénovation","par infiltration"]
[null,4,"Attribution",null,null,null,"autre",null,"emprise à réaliser",null,"Création d'itinéraire cyclo-piéton",null,null,null,null,null,null,null,"intermodalité","maison communale d'accueil de l'enfance","rénovation avec extension","autre"]
[null,5,null,null,null,null,null,null,null,null,"Création d'un trottoir",null,null,null,null,null,null,null,null,"crèche","acquisition d'un bâtiment"]
[null,6,null,null,null,null,null,null,null,null,"Eclairage public",null,null,null,null,null,null,null,null,"PISQ","amélioration de l'accessibilité"]
{"$rows_left_out":65}
{"sheet":"metadata","index":25,"n_rows":53,"n_cols":23,"rows_kept":53,"cut":false,"hidden":true,"merged":[]}
[null,"XL (gare régionale)","L (Gare supra-locale de destination ou mixte)","M (Gare supralocale d'origine, gare locale ou gare bus)","S (Arrêt de bus sur ligne structurante)","XS (Point NON-URBAIN de multimodalité sans transport public structurant)","XS mobipoint (Point URBAIN de multimodalité sans transport public structurant)",null,null,null,null,null,null,null,"type de mobipôle/mobipoint"]
[null,"XL","L","M","S","XS","XS_mobipoint",null,null,null,"XL","Quelle(s) ligne(s) structurante(s) se trouve(nt) sur le mobipôle (+ nom de(s) l'arrêt(s))",null,null,"XL (gare régionale)",null,null,"Oui"]
[1,"Itinéraires cyclables larges et sécurisés sur le site et pour l'accès immédiat ","Itinéraires cyclables larges et sécurisés sur le site et pour l'accès immédiat ","Itinéraires cyclables larges et sécurisés sur le site et pour l'accès immédiat ","Itinéraires cyclables larges et sécurisés sur le site et pour l'accès immédiat ","Itinéraires cyclables larges et sécurisés sur le site et pour l'accès immédiat ","Itinéraires cyclables larges et sécurisés sur le site et pour l'accès immédiat ",null,null,null,"L","Quelle(s) ligne(s) structurante(s) se trouve(nt) sur le mobipôle (+ nom de(s) l'arrêt(s))",null,null,"L (gare supra-locale de destination ou mixte)",null,null,"Non",null,null,null,"Connectée","La commune est considérée comme  connectée au réseau structurant de transport en commun (train, tram, lignes de bus express ou principale). La priorité étant donnée aux mobipôles à vocation structurante, les mobipôles attendus sont donc de type XL, L, M ou S. Si un mobipôle de type XS est proposé, merci de justifier."]
[1,"Cheminements de rabattement continus et présentant un niveau de confort, de sécurité et efficacité renforcé dans un périmètre de 5km (conforme aux recommandations en vigueur dans la Sécurothèque) ","Cheminements de rabattement continus et présentant un niveau de confort, de sécurité et efficacité renforcé dans un périmètre de 5km (conforme aux recommandations en vigueur dans la Sécurothèque) ","Cheminements de rabattement continus et présentant un niveau de confort, de sécurité et efficacité renforcé dans un périmètre de 5km (conforme aux recommandations en vigueur dans la Sécurothèque) ","Cheminements de rabattement continus et présentant un niveau de confort, de sécurité et efficacité renforcé dans un périmètre de 5km (conforme aux recommandations en vigueur dans la Sécurothèque) ","Cheminements de rabattement continus et présentant un niveau de confort, de sécurité et efficacité renforcé dans un périmètre de 5km (conforme aux recommandations en vigueur dans la Sécurothèque) ","Cheminements de rabattement continus et présentant un niveau de confort, de sécurité et efficacité renforcé dans un périmètre de 5km (conforme aux recommandations en vigueur dans la Sécurothèque) ",null,null,null,"M","Quelle(s) ligne(s) structurante(s) se trouve(nt) sur le mobipôle (+ nom de(s) l'arrêt(s))",null,null,"M (gare supralocale d'origine, gare locale ou gare bus)",null,null,null,null,null,null,"Non connectée","La commune est considérée comme non connectée au réseau structurant de transport en commun (train, tram, lignes de bus express ou principale). Des études de connexion sont programmées par la Région d'ici 2030. Les mobipôles attendus sont donc uniquement de type XS."]
[2,"Trottoirs et passages piétons larges et sécurisés sur le site et pour l'accès immédiat ","Trottoirs et passages piétons larges et sécurisés sur le site et pour l'accès immédiat ","Trottoirs et passages piétons larges et sécurisés sur le site et pour l'accès immédiat ","Trottoirs et passages piétons larges et sécurisés sur le site et pour l'accès immédiat ","Trottoirs et passages piétons larges et sécurisés sur le site et pour l'accès immédiat ","Trottoirs et passages piétons larges et sécurisés sur le site et pour l'accès immédiat ",null,null,null,"S","Quelle(s) ligne(s) structurante(s) se trouve(nt) sur le mobipôle (+ nom de(s) l'arrêt(s))",null,null,"S (arrêt de bus sur ligne structurante)",null,null,null,null,null,null,"Non connectée - Liaison définie non opérationnalisée","La commune est considérée comme non connectée au réseau structurant de transport en commun (train, tram, lignes de bus express ou principales) car une ligne structurante n'est pas encore mise en oeuvre. Les mobipôles attendus seraient donc de type XS. Cependant, une liaison structurante de transport en commun a été définie par la Région en collaboration avec la commune. La priorité étant donnée aux mobipôles à vocation structurante, un mobipôle de taille S peut donc être envisagé (localisation stratégique sur base de la liaison structurante définie). "]
[2,"Cheminements internes présentant un niveau de confort, de sécurité et efficacité renforcé","Cheminements internes présentant un niveau de confort, de sécurité et efficacité renforcé","Cheminements internes présentant un niveau de confort, de sécurité et efficacité renforcé","Cheminements internes présentant un niveau de confort, de sécurité et efficacité renforcé","Cheminements internes présentant un niveau de confort, de sécurité et efficacité renforcé","Cheminements internes présentant un niveau de confort, de sécurité et efficacité renforcé",null,null,null,"XS","Le mobipôle ne se trouve pas sur le réseau structurant, quels autres éléments justifient sa localisation?",null,null,"XS (point NON-URBAIN de multimodalité sans transport public structurant)"]
{"$rows_left_out":47}